move test in CI into build stage

2 jobs for master in 1 minute and 21 seconds
latest
Status Job ID Name Coverage
  Build
failed #350
docker alpine
build-clang

00:00:43

failed #349
docker alpine
build-gcc

00:00:38

 
Name Stage Failure
failed
build-clang Build There is an unknown failure, please try again
make[4]: Leaving directory '/builds/xiph/liboggz/src/tools/oggz-chop'
make[3]: *** [Makefile:1017: check-am] Error 2
make[3]: Leaving directory '/builds/xiph/liboggz/src/tools/oggz-chop'
make[2]: *** [Makefile:757: check-recursive] Error 1
make[2]: Leaving directory '/builds/xiph/liboggz/src/tools'
make[1]: *** [Makefile:376: check-recursive] Error 1
make[1]: Leaving directory '/builds/xiph/liboggz/src'
make: *** [Makefile:601: check-recursive] Error 1
ERROR: Job failed: exit code 2
failed
build-gcc Build There is an unknown failure, please try again
make[4]: Leaving directory '/builds/xiph/liboggz/src/tools/oggz-chop'
make[3]: *** [Makefile:1017: check-am] Error 2
make[3]: Leaving directory '/builds/xiph/liboggz/src/tools/oggz-chop'
make[2]: *** [Makefile:757: check-recursive] Error 1
make[2]: Leaving directory '/builds/xiph/liboggz/src/tools'
make[1]: *** [Makefile:376: check-recursive] Error 1
make[1]: Leaving directory '/builds/xiph/liboggz/src'
make: *** [Makefile:601: check-recursive] Error 1
ERROR: Job failed: exit code 2